{"text_format":"1","workbook":"xlsx","n_sheets":5,"sheets":["Transacción","Base Datos","Control Inv","Indices","Consultas"],"not_rendered":{"charts":1,"images":2,"macros":1,"external_links":0,"defined_names":2,"comments":1,"pivot_tables":0},"unopened":[],"bounds":{"document_bytes":16777216,"sheet_cells":100000,"rows_first":2000,"rows_last":500,"rows_between":2000,"halvings":0,"cell_chars":16384,"cell_head_chars":4096},"cells_cut":0,"cells_raw":0,"read":"whole","date_system":"1900"}

{"sheet":"Transacción","index":0,"n_rows":26,"n_cols":34,"rows_kept":26,"cut":false,"hidden":false,"merged":[[3,4,3,5],[1,1,2,3]]}
[]
[null,"TRANSACCIÓN DE PRODUCTOS",null,null,null,null,null,null,null,1]
[]
[null,"Fecha:",{"$f":"TODAY()","v":"2024-04-04"},"Consecutivo:",{"$f":"IF(C6=\"ENTRADA\",'Base Datos'!K3+1,'Base Datos'!L3+1)","v":3}]
[]
[null,"Transacción:","SALIDA",null,null,null,null,null,null,null,null,null,null,null,null,null,null,null,null,null,null,null,null,null,null,null,"Archivo Plano"]
[]
[null,"Código","Descripción Producto","Referencia","Und/Med.","Cantidad",null,"Saldo/Act.",null,null,null,null,null,null,null,null,null,null,null,null,null,null,null,null,null,null,"Fecha","Conse","Transacción","Código","Descripción","Referencia ","Und/Med","Cantidad"]
[null,{"$f":"IFERROR(INDEX('Control Inv'!$B$6:$E$10000,MATCH(C9,'Control Inv'!$C$6:$C$10000,0),1),0)","v":0},null,{"$f":"IFERROR((INDEX('Control Inv'!$B$6:$E$10000,MATCH(C9,'Control Inv'!$C$6:$C$10000,0),3)),0)","v":0},{"$f":"IFERROR((INDEX('Control Inv'!$B$6:$E$10000,MATCH(C9,'Control Inv'!$C$6:$C$10000,0),4)),0)","v":0},null,null,{"$f":"IF($C$6=\"ENTRADA\",INDEX('Control Inv'!$B$6:$J$10000,MATCH(C9,'Control Inv'!$C$6:$C$10000,0),9)+F9,INDEX('Control Inv'!$B$6:$J$10000,MATCH(C9,'Control Inv'!$C$6:$C$10000,0),9)-F9)","v":0},null,null,null,null,null,null,null,null,null,null,null,null,null,null,null,null,null,null,{"$f":"IF(AH9<>0,$C$4,0)","v":"00:00:00"},{"$f":"IF(AH9<>0,$E$4,0)","v":0},{"$f":"IF(AH9<>0,$C$6,0)","v":0},{"$f":"B9","v":0},{"$f":"C9","v":0},{"$f":"D9","v":0},{"$f":"E9","v":0},{"$f":"F9","v":0}]
[null,{"$f":"IFERROR(INDEX('Control Inv'!$B$6:$E$10000,MATCH(C10,'Control Inv'!$C$6:$C$10000,0),1),0)","v":0},null,{"$f":"IFERROR((INDEX('Control Inv'!$B$6:$E$10000,MATCH(C10,'Control Inv'!$C$6:$C$10000,0),3)),0)","v":0},{"$f":"IFERROR((INDEX('Control Inv'!$B$6:$E$10000,MATCH(C10,'Control Inv'!$C$6:$C$10000,0),4)),0)","v":0},null,null,{"$f":"IF($C$6=\"ENTRADA\",INDEX('Control Inv'!$B$6:$J$10000,MATCH(C10,'Control Inv'!$C$6:$C$10000,0),9)+F10,INDEX('Control Inv'!$B$6:$J$10000,MATCH(C10,'Control Inv'!$C$6:$C$10000,0),9)-F10)","v":0},null,null,null,null,null,null,null,null,null,null,null,null,null,null,null,null,null,null,{"$f":"IF(AH10<>0,$C$4,0)","v":"00:00:00"},{"$f":"IF(AH10<>0,$E$4,0)","v":0},{"$f":"IF(AH10<>0,$C$6,0)","v":0},{"$f":"B10","v":0},{"$f":"C10","v":0},{"$f":"D10","v":0},{"$f":"E10","v":0},{"$f":"F10","v":0}]
[null,{"$f":"IFERROR(INDEX('Control Inv'!$B$6:$E$10000,MATCH(C11,'Control Inv'!$C$6:$C$10000,0),1),0)","v":0},null,{"$f":"IFERROR((INDEX('Control Inv'!$B$6:$E$10000,MATCH(C11,'Control Inv'!$C$6:$C$10000,0),3)),0)","v":0},{"$f":"IFERROR((INDEX('Control Inv'!$B$6:$E$10000,MATCH(C11,'Control Inv'!$C$6:$C$10000,0),4)),0)","v":0},null,null,{"$f":"IF($C$6=\"ENTRADA\",INDEX('Control Inv'!$B$6:$J$10000,MATCH(C11,'Control Inv'!$C$6:$C$10000,0),9)+F11,INDEX('Control Inv'!$B$6:$J$10000,MATCH(C11,'Control Inv'!$C$6:$C$10000,0),9)-F11)","v":0},null,null,null,null,null,null,null,null,null,null,null,null,null,null,null,null,null,null,"00:00:00",0,0,0,0,0,0,0]
[null,{"$f":"IFERROR(INDEX('Control Inv'!$B$6:$E$10000,MATCH(C12,'Control Inv'!$C$6:$C$10000,0),1),0)","v":0},null,{"$f":"IFERROR((INDEX('Control Inv'!$B$6:$E$10000,MATCH(C12,'Control Inv'!$C$6:$C$10000,0),3)),0)","v":0},{"$f":"IFERROR((INDEX('Control Inv'!$B$6:$E$10000,MATCH(C12,'Control Inv'!$C$6:$C$10000,0),4)),0)","v":0},null,null,{"$f":"IF($C$6=\"ENTRADA\",INDEX('Control Inv'!$B$6:$J$10000,MATCH(C12,'Control Inv'!$C$6:$C$10000,0),9)+F12,INDEX('Control Inv'!$B$6:$J$10000,MATCH(C12,'Control Inv'!$C$6:$C$10000,0),9)-F12)","v":0},null,null,null,null,null,null,null,null,null,null,null,null,null,null,null,null,null,null,"00:00:00",0,0,0,0,0,0,0]
[null,{"$f":"IFERROR(INDEX('Control Inv'!$B$6:$E$10000,MATCH(C13,'Control Inv'!$C$6:$C$10000,0),1),0)","v":0},null,{"$f":"IFERROR((INDEX('Control Inv'!$B$6:$E$10000,MATCH(C13,'Control Inv'!$C$6:$C$10000,0),3)),0)","v":0},{"$f":"IFERROR((INDEX('Control Inv'!$B$6:$E$10000,MATCH(C13,'Control Inv'!$C$6:$C$10000,0),4)),0)","v":0},null,null,{"$f":"IF($C$6=\"ENTRADA\",INDEX('Control Inv'!$B$6:$J$10000,MATCH(C13,'Control Inv'!$C$6:$C$10000,0),9)+F13,INDEX('Control Inv'!$B$6:$J$10000,MATCH(C13,'Control Inv'!$C$6:$C$10000,0),9)-F13)","v":0},null,null,null,null,null,null,null,null,null,null,null,null,null,null,null,null,null,null,"00:00:00",0,0,0,0,0,0,0]
[null,{"$f":"IFERROR(INDEX('Control Inv'!$B$6:$E$10000,MATCH(C14,'Control Inv'!$C$6:$C$10000,0),1),0)","v":0},null,{"$f":"IFERROR((INDEX('Control Inv'!$B$6:$E$10000,MATCH(C14,'Control Inv'!$C$6:$C$10000,0),3)),0)","v":0},{"$f":"IFERROR((INDEX('Control Inv'!$B$6:$E$10000,MATCH(C14,'Control Inv'!$C$6:$C$10000,0),4)),0)","v":0},null,null,{"$f":"IF($C$6=\"ENTRADA\",INDEX('Control Inv'!$B$6:$J$10000,MATCH(C14,'Control Inv'!$C$6:$C$10000,0),9)+F14,INDEX('Control Inv'!$B$6:$J$10000,MATCH(C14,'Control Inv'!$C$6:$C$10000,0),9)-F14)","v":0},null,null,null,null,null,null,null,null,null,null,null,null,null,null,null,null,null,null,"00:00:00",0,0,0,0,0,0,0]
[null,{"$f":"IFERROR(INDEX('Control Inv'!$B$6:$E$10000,MATCH(C15,'Control Inv'!$C$6:$C$10000,0),1),0)","v":0},null,{"$f":"IFERROR((INDEX('Control Inv'!$B$6:$E$10000,MATCH(C15,'Control Inv'!$C$6:$C$10000,0),3)),0)","v":0},{"$f":"IFERROR((INDEX('Control Inv'!$B$6:$E$10000,MATCH(C15,'Control Inv'!$C$6:$C$10000,0),4)),0)","v":0},null,null,{"$f":"IF($C$6=\"ENTRADA\",INDEX('Control Inv'!$B$6:$J$10000,MATCH(C15,'Control Inv'!$C$6:$C$10000,0),9)+F15,INDEX('Control Inv'!$B$6:$J$10000,MATCH(C15,'Control Inv'!$C$6:$C$10000,0),9)-F15)","v":0},null,null,null,null,null,null,null,null,null,null,null,null,null,null,null,null,null,null,"00:00:00",0,0,0,0,0,0,0]
[null,{"$f":"IFERROR(INDEX('Control Inv'!$B$6:$E$10000,MATCH(C16,'Control Inv'!$C$6:$C$10000,0),1),0)","v":0},null,{"$f":"IFERROR((INDEX('Control Inv'!$B$6:$E$10000,MATCH(C16,'Control Inv'!$C$6:$C$10000,0),3)),0)","v":0},{"$f":"IFERROR((INDEX('Control Inv'!$B$6:$E$10000,MATCH(C16,'Control Inv'!$C$6:$C$10000,0),4)),0)","v":0},null,null,{"$f":"IF($C$6=\"ENTRADA\",INDEX('Control Inv'!$B$6:$J$10000,MATCH(C16,'Control Inv'!$C$6:$C$10000,0),9)+F16,INDEX('Control Inv'!$B$6:$J$10000,MATCH(C16,'Control Inv'!$C$6:$C$10000,0),9)-F16)","v":0},null,null,null,null,null,null,null,null,null,null,null,null,null,null,null,null,null,null,"00:00:00",0,0,0,0,0,0,0]
[null,{"$f":"IFERROR(INDEX('Control Inv'!$B$6:$E$10000,MATCH(C17,'Control Inv'!$C$6:$C$10000,0),1),0)","v":0},null,{"$f":"IFERROR((INDEX('Control Inv'!$B$6:$E$10000,MATCH(C17,'Control Inv'!$C$6:$C$10000,0),3)),0)","v":0},{"$f":"IFERROR((INDEX('Control Inv'!$B$6:$E$10000,MATCH(C17,'Control Inv'!$C$6:$C$10000,0),4)),0)","v":0},null,null,{"$f":"IF($C$6=\"ENTRADA\",INDEX('Control Inv'!$B$6:$J$10000,MATCH(C17,'Control Inv'!$C$6:$C$10000,0),9)+F17,INDEX('Control Inv'!$B$6:$J$10000,MATCH(C17,'Control Inv'!$C$6:$C$10000,0),9)-F17)","v":0},null,null,null,null,null,null,null,null,null,null,null,null,null,null,null,null,null,null,"00:00:00",0,0,0,0,0,0,0]
[null,{"$f":"IFERROR(INDEX('Control Inv'!$B$6:$E$10000,MATCH(C18,'Control Inv'!$C$6:$C$10000,0),1),0)","v":0},null,{"$f":"IFERROR((INDEX('Control Inv'!$B$6:$E$10000,MATCH(C18,'Control Inv'!$C$6:$C$10000,0),3)),0)","v":0},{"$f":"IFERROR((INDEX('Control Inv'!$B$6:$E$10000,MATCH(C18,'Control Inv'!$C$6:$C$10000,0),4)),0)","v":0},null,null,{"$f":"IF($C$6=\"ENTRADA\",INDEX('Control Inv'!$B$6:$J$10000,MATCH(C18,'Control Inv'!$C$6:$C$10000,0),9)+F18,INDEX('Control Inv'!$B$6:$J$10000,MATCH(C18,'Control Inv'!$C$6:$C$10000,0),9)-F18)","v":0},null,null,null,null,null,null,null,null,null,null,null,null,null,null,null,null,null,null,"00:00:00",0,0,0,0,0,0,0]
[null,{"$f":"IFERROR(INDEX('Control Inv'!$B$6:$E$10000,MATCH(C19,'Control Inv'!$C$6:$C$10000,0),1),0)","v":0},null,{"$f":"IFERROR((INDEX('Control Inv'!$B$6:$E$10000,MATCH(C19,'Control Inv'!$C$6:$C$10000,0),3)),0)","v":0},{"$f":"IFERROR((INDEX('Control Inv'!$B$6:$E$10000,MATCH(C19,'Control Inv'!$C$6:$C$10000,0),4)),0)","v":0},null,null,{"$f":"IF($C$6=\"ENTRADA\",INDEX('Control Inv'!$B$6:$J$10000,MATCH(C19,'Control Inv'!$C$6:$C$10000,0),9)+F19,INDEX('Control Inv'!$B$6:$J$10000,MATCH(C19,'Control Inv'!$C$6:$C$10000,0),9)-F19)","v":0},null,null,null,null,null,null,null,null,null,null,null,null,null,null,null,null,null,null,"00:00:00",0,0,0,0,0,0,0]
[null,{"$f":"IFERROR(INDEX('Control Inv'!$B$6:$E$10000,MATCH(C20,'Control Inv'!$C$6:$C$10000,0),1),0)","v":0},null,{"$f":"IFERROR((INDEX('Control Inv'!$B$6:$E$10000,MATCH(C20,'Control Inv'!$C$6:$C$10000,0),3)),0)","v":0},{"$f":"IFERROR((INDEX('Control Inv'!$B$6:$E$10000,MATCH(C20,'Control Inv'!$C$6:$C$10000,0),4)),0)","v":0},null,null,{"$f":"IF($C$6=\"ENTRADA\",INDEX('Control Inv'!$B$6:$J$10000,MATCH(C20,'Control Inv'!$C$6:$C$10000,0),9)+F20,INDEX('Control Inv'!$B$6:$J$10000,MATCH(C20,'Control Inv'!$C$6:$C$10000,0),9)-F20)","v":0},null,null,null,null,null,null,null,null,null,null,null,null,null,null,null,null,null,null,"00:00:00",0,0,0,0,0,0,0]
[null,{"$f":"IFERROR(INDEX('Control Inv'!$B$6:$E$10000,MATCH(C21,'Control Inv'!$C$6:$C$10000,0),1),0)","v":0},null,{"$f":"IFERROR((INDEX('Control Inv'!$B$6:$E$10000,MATCH(C21,'Control Inv'!$C$6:$C$10000,0),3)),0)","v":0},{"$f":"IFERROR((INDEX('Control Inv'!$B$6:$E$10000,MATCH(C21,'Control Inv'!$C$6:$C$10000,0),4)),0)","v":0},null,null,{"$f":"IF($C$6=\"ENTRADA\",INDEX('Control Inv'!$B$6:$J$10000,MATCH(C21,'Control Inv'!$C$6:$C$10000,0),9)+F21,INDEX('Control Inv'!$B$6:$J$10000,MATCH(C21,'Control Inv'!$C$6:$C$10000,0),9)-F21)","v":0},null,null,null,null,null,null,null,null,null,null,null,null,null,null,null,null,null,null,"00:00:00",0,0,0,0,0,0,0]
[null,{"$f":"IFERROR(INDEX('Control Inv'!$B$6:$E$10000,MATCH(C22,'Control Inv'!$C$6:$C$10000,0),1),0)","v":0},null,{"$f":"IFERROR((INDEX('Control Inv'!$B$6:$E$10000,MATCH(C22,'Control Inv'!$C$6:$C$10000,0),3)),0)","v":0},{"$f":"IFERROR((INDEX('Control Inv'!$B$6:$E$10000,MATCH(C22,'Control Inv'!$C$6:$C$10000,0),4)),0)","v":0},null,null,{"$f":"IF($C$6=\"ENTRADA\",INDEX('Control Inv'!$B$6:$J$10000,MATCH(C22,'Control Inv'!$C$6:$C$10000,0),9)+F22,INDEX('Control Inv'!$B$6:$J$10000,MATCH(C22,'Control Inv'!$C$6:$C$10000,0),9)-F22)","v":0},null,null,null,null,null,null,null,null,null,null,null,null,null,null,null,null,null,null,"00:00:00",0,0,0,0,0,0,0]
[null,{"$f":"IFERROR(INDEX('Control Inv'!$B$6:$E$10000,MATCH(C23,'Control Inv'!$C$6:$C$10000,0),1),0)","v":0},null,{"$f":"IFERROR((INDEX('Control Inv'!$B$6:$E$10000,MATCH(C23,'Control Inv'!$C$6:$C$10000,0),3)),0)","v":0},{"$f":"IFERROR((INDEX('Control Inv'!$B$6:$E$10000,MATCH(C23,'Control Inv'!$C$6:$C$10000,0),4)),0)","v":0},null,null,{"$f":"IF($C$6=\"ENTRADA\",INDEX('Control Inv'!$B$6:$J$10000,MATCH(C23,'Control Inv'!$C$6:$C$10000,0),9)+F23,INDEX('Control Inv'!$B$6:$J$10000,MATCH(C23,'Control Inv'!$C$6:$C$10000,0),9)-F23)","v":0},null,null,null,null,null,null,null,null,null,null,null,null,null,null,null,null,null,null,"00:00:00",0,0,0,0,0,0,0]
[null,null,null,"Total de unidades",null,{"$f":"SUM(F9:F23)","v":0},null,{"$f":"SUM(H9:H23)","v":0}]
[]
[null,null,null,null,4]

{"sheet":"Base Datos","index":1,"n_rows":3000,"n_cols":12,"rows_kept":3000,"cut":false,"hidden":false,"merged":[[1,1,1,4]]}
[]
[null,"BASE DE DATOS MOVIMIENTOS"]
[null,null,null,null,null,null,null,null,null,null,{"$f":"MAX(K5:K3000)","v":3},{"$f":"MAX(L5:L3000)","v":2}]
[null,"Fecha","Conse","Transacción","Codigo","Descripción","Referencia ","Und/Med","Cantidad","ID","E","S"]
[null,"2021-11-01",1,"ENTRADA",485,"Acople Pista 14-11mm","FX036","Unidad",800,{"$f":"CONCATENATE(LEFT(D5,1),E5)","v":"E485"},{"$f":"IF(D5=\"ENTRADA\",C5,0)","v":1},{"$f":"IF(D5=\"SALIDA\",C5,0)","v":0}]
[null,"2021-11-01",1,"ENTRADA",784,"Pasador FP 343",343,"Unidad",400,{"$f":"CONCATENATE(LEFT(D6,1),E6)","v":"E784"},{"$f":"IF(D6=\"ENTRADA\",C6,0)","v":1},{"$f":"IF(D6=\"SALIDA\",C6,0)","v":0}]
[null,"2021-11-01",1,"ENTRADA",957,"Tornilo Central 5/16\" X 3 1/2\"","Galvanizado","Unidad",1000,"E957",{"$f":"IF(D7=\"ENTRADA\",C7,0)","v":1},{"$f":"IF(D7=\"SALIDA\",C7,0)","v":0}]
[null,"2021-11-01",1,"SALIDA",957,"Tornilo Central 5/16\" X 3 1/2\"","Galvanizado","Unidad",7500,"S957",0,1]
[null,"2021-11-01",1,"SALIDA",942,"Pegante sintetico","Acrilico","Litros",50,"S942",0,1]
[null,"2021-11-01",2,"ENTRADA",942,"Pegante sintetico","Acrilico","Litros",200,"E942",2,0]
[null,"2021-11-01",2,"SALIDA",123,"Arandela 1 1/2\" SUP",1035,"Unidad",280,"S123",0,2]
[null,"2021-11-01",3,"ENTRADA",957,"Tornilo Central 5/16\" X 3 1/2\"","Galvanizado","Unidad",500,"E957",3,0]
[null,"00:00:00",0,0,0,0,0,0,0,"00",0,0]
[null,"00:00:00",0,0,0,0,0,0,0,"00",0,0]
[null,"00:00:00",0,0,0,0,0,0,0,"00",0,0]
[null,"00:00:00",0,0,0,0,0,0,0,"00",0,0]
[null,"00:00:00",0,0,0,0,0,0,0,"00",0,0]
[null,"00:00:00",0,0,0,0,0,0,0,"00",0,0]
[null,"00:00:00",0,0,0,0,0,0,0,"00",0,0]
[null,"00:00:00",0,0,0,0,0,0,0,"00",0,0]
[null,"00:00:00",0,0,0,0,0,0,0,"00",0,0]
[null,"00:00:00",0,0,0,0,0,0,0,"00",0,0]
[null,"00:00:00",0,0,0,0,0,0,0,"00",0,0]
[null,"00:00:00",0,0,0,0,0,0,0,"00",0,0]
[null,"00:00:00",0,0,0,0,0,0,0,"00",0,0]
[null,"00:00:00",0,0,0,0,0,0,0,"00",0,0]
[null,"00:00:00",0,0,0,0,0,0,0,"00",0,0]
[null,null,null,null,null,null,null,null,null,"",0,0]
[null,null,null,null,null,null,null,null,null,"",0,0]
[null,null,null,null,null,null,null,null,null,"",0,0]
{"$rows_left_out":2971}
{"sheet":"Control Inv","index":2,"n_rows":1003,"n_cols":11,"rows_kept":1003,"cut":false,"hidden":false,"merged":[[2,1,3,2],[3,7,3,9],[3,3,3,5]]}
[]
[null,null,null,null,null,null,{"$f":"SUM(G6:G1000)","v":32395},2900,7830,27465,266]
[null,"CONTROL Y ADMINISTRACION DE INVENTARIO"]
[null,null,null,{"$f":"(TODAY())","v":"2024-04-04"},null,null,null,"Movimiento"]
[null,"Codigo","Descripción","Referencia","Und/Med","Prom/dia","Saldo Ini","Entradas","Salidas","Saldo Und","Saldo Dias"]
[null,123,"Arandela 1 1/2\" SUP",1035,"Unidad",120,1280,{"$f":"SUMIF('Base Datos'!$J$5:$J$30000,CONCATENATE(\"E\",B6),'Base Datos'!$I$5:$I$30000)","v":0},{"$f":"SUMIF('Base Datos'!$J$5:$J$30000,CONCATENATE(\"S\",B6),'Base Datos'!$I$5:$I$30000)","v":280},{"$f":"(G6+H6-I6)","v":1000},{"$f":"IFERROR(ROUND(J6/F6,0),\"\")","v":8}]
[null,485,"Acople Pista 14-11mm","FX036","Unidad",85,5200,{"$f":"SUMIF('Base Datos'!$J$5:$J$30000,CONCATENATE(\"E\",B7),'Base Datos'!$I$5:$I$30000)","v":800},{"$f":"SUMIF('Base Datos'!$J$5:$J$30000,CONCATENATE(\"S\",B7),'Base Datos'!$I$5:$I$30000)","v":0},{"$f":"(G7+H7-I7)","v":6000},{"$f":"IFERROR(ROUND(J7/F7,0),\"\")","v":71}]
[null,784,"Pasador FP 343",343,"Unidad",280,600,{"$f":"SUMIF('Base Datos'!$J$5:$J$30000,CONCATENATE(\"E\",B8),'Base Datos'!$I$5:$I$30000)","v":400},{"$f":"SUMIF('Base Datos'!$J$5:$J$30000,CONCATENATE(\"S\",B8),'Base Datos'!$I$5:$I$30000)","v":0},1000,4]
[null,605,"Soldadura 1/4","MTE1035","Kilos",15,230,{"$f":"SUMIF('Base Datos'!$J$5:$J$30000,CONCATENATE(\"E\",B9),'Base Datos'!$I$5:$I$30000)","v":0},{"$f":"SUMIF('Base Datos'!$J$5:$J$30000,CONCATENATE(\"S\",B9),'Base Datos'!$I$5:$I$30000)","v":0},230,15]
[null,942,"Pegante sintetico","Acrilico","Litros",1.5,85,{"$f":"SUMIF('Base Datos'!$J$5:$J$30000,CONCATENATE(\"E\",B10),'Base Datos'!$I$5:$I$30000)","v":200},{"$f":"SUMIF('Base Datos'!$J$5:$J$30000,CONCATENATE(\"S\",B10),'Base Datos'!$I$5:$I$30000)","v":50},235,157]
[null,957,"Tornilo Central 5/16\" X 3 1/2\"","Galvanizado","Unidad",1780,25000,{"$f":"SUMIF('Base Datos'!$J$5:$J$30000,CONCATENATE(\"E\",B11),'Base Datos'!$I$5:$I$30000)","v":1500},{"$f":"SUMIF('Base Datos'!$J$5:$J$30000,CONCATENATE(\"S\",B11),'Base Datos'!$I$5:$I$30000)","v":7500},19000,11]
[null,null,null,null,null,null,null,{"$f":"SUMIF('Base Datos'!$J$5:$J$30000,CONCATENATE(\"E\",B12),'Base Datos'!$I$5:$I$30000)","v":0},{"$f":"SUMIF('Base Datos'!$J$5:$J$30000,CONCATENATE(\"S\",B12),'Base Datos'!$I$5:$I$30000)","v":0},0,""]
[null,null,null,null,null,null,null,{"$f":"SUMIF('Base Datos'!$J$5:$J$30000,CONCATENATE(\"E\",B13),'Base Datos'!$I$5:$I$30000)","v":0},{"$f":"SUMIF('Base Datos'!$J$5:$J$30000,CONCATENATE(\"S\",B13),'Base Datos'!$I$5:$I$30000)","v":0},{"$f":"(G13+H13-I13)","v":0},""]
[null,null,null,null,null,null,null,{"$f":"SUMIF('Base Datos'!$J$5:$J$30000,CONCATENATE(\"E\",B14),'Base Datos'!$I$5:$I$30000)","v":0},{"$f":"SUMIF('Base Datos'!$J$5:$J$30000,CONCATENATE(\"S\",B14),'Base Datos'!$I$5:$I$30000)","v":0},0,""]
[null,null,null,null,null,null,null,{"$f":"SUMIF('Base Datos'!$J$5:$J$30000,CONCATENATE(\"E\",B15),'Base Datos'!$I$5:$I$30000)","v":0},{"$f":"SUMIF('Base Datos'!$J$5:$J$30000,CONCATENATE(\"S\",B15),'Base Datos'!$I$5:$I$30000)","v":0},0,""]
[null,null,null,null,null,null,null,{"$f":"SUMIF('Base Datos'!$J$5:$J$30000,CONCATENATE(\"E\",B16),'Base Datos'!$I$5:$I$30000)","v":0},{"$f":"SUMIF('Base Datos'!$J$5:$J$30000,CONCATENATE(\"S\",B16),'Base Datos'!$I$5:$I$30000)","v":0},0,""]
[null,null,null,null,null,null,null,{"$f":"SUMIF('Base Datos'!$J$5:$J$30000,CONCATENATE(\"E\",B17),'Base Datos'!$I$5:$I$30000)","v":0},{"$f":"SUMIF('Base Datos'!$J$5:$J$30000,CONCATENATE(\"S\",B17),'Base Datos'!$I$5:$I$30000)","v":0},0,""]
[null,null,null,null,null,null,null,{"$f":"SUMIF('Base Datos'!$J$5:$J$30000,CONCATENATE(\"E\",B18),'Base Datos'!$I$5:$I$30000)","v":0},{"$f":"SUMIF('Base Datos'!$J$5:$J$30000,CONCATENATE(\"S\",B18),'Base Datos'!$I$5:$I$30000)","v":0},0,""]
[null,null,null,null,null,null,null,{"$f":"SUMIF('Base Datos'!$J$5:$J$30000,CONCATENATE(\"E\",B19),'Base Datos'!$I$5:$I$30000)","v":0},{"$f":"SUMIF('Base Datos'!$J$5:$J$30000,CONCATENATE(\"S\",B19),'Base Datos'!$I$5:$I$30000)","v":0},0,""]
[null,null,null,null,null,null,null,{"$f":"SUMIF('Base Datos'!$J$5:$J$30000,CONCATENATE(\"E\",B20),'Base Datos'!$I$5:$I$30000)","v":0},{"$f":"SUMIF('Base Datos'!$J$5:$J$30000,CONCATENATE(\"S\",B20),'Base Datos'!$I$5:$I$30000)","v":0},0,""]
[null,null,null,null,null,null,null,{"$f":"SUMIF('Base Datos'!$J$5:$J$30000,CONCATENATE(\"E\",B21),'Base Datos'!$I$5:$I$30000)","v":0},{"$f":"SUMIF('Base Datos'!$J$5:$J$30000,CONCATENATE(\"S\",B21),'Base Datos'!$I$5:$I$30000)","v":0},0,""]
[null,null,null,null,null,null,null,{"$f":"SUMIF('Base Datos'!$J$5:$J$30000,CONCATENATE(\"E\",B22),'Base Datos'!$I$5:$I$30000)","v":0},{"$f":"SUMIF('Base Datos'!$J$5:$J$30000,CONCATENATE(\"S\",B22),'Base Datos'!$I$5:$I$30000)","v":0},0,""]
[null,null,null,null,null,null,null,{"$f":"SUMIF('Base Datos'!$J$5:$J$30000,CONCATENATE(\"E\",B23),'Base Datos'!$I$5:$I$30000)","v":0},{"$f":"SUMIF('Base Datos'!$J$5:$J$30000,CONCATENATE(\"S\",B23),'Base Datos'!$I$5:$I$30000)","v":0},0,""]
[null,null,null,null,null,null,null,{"$f":"SUMIF('Base Datos'!$J$5:$J$30000,CONCATENATE(\"E\",B24),'Base Datos'!$I$5:$I$30000)","v":0},{"$f":"SUMIF('Base Datos'!$J$5:$J$30000,CONCATENATE(\"S\",B24),'Base Datos'!$I$5:$I$30000)","v":0},0,""]
[null,null,null,null,null,null,null,{"$f":"SUMIF('Base Datos'!$J$5:$J$30000,CONCATENATE(\"E\",B25),'Base Datos'!$I$5:$I$30000)","v":0},{"$f":"SUMIF('Base Datos'!$J$5:$J$30000,CONCATENATE(\"S\",B25),'Base Datos'!$I$5:$I$30000)","v":0},0,""]
[null,null,null,null,null,null,null,{"$f":"SUMIF('Base Datos'!$J$5:$J$30000,CONCATENATE(\"E\",B26),'Base Datos'!$I$5:$I$30000)","v":0},{"$f":"SUMIF('Base Datos'!$J$5:$J$30000,CONCATENATE(\"S\",B26),'Base Datos'!$I$5:$I$30000)","v":0},0,""]
[null,null,null,null,null,null,null,{"$f":"SUMIF('Base Datos'!$J$5:$J$30000,CONCATENATE(\"E\",B27),'Base Datos'!$I$5:$I$30000)","v":0},{"$f":"SUMIF('Base Datos'!$J$5:$J$30000,CONCATENATE(\"S\",B27),'Base Datos'!$I$5:$I$30000)","v":0},0,""]
[null,null,null,null,null,null,null,{"$f":"SUMIF('Base Datos'!$J$5:$J$30000,CONCATENATE(\"E\",B28),'Base Datos'!$I$5:$I$30000)","v":0},{"$f":"SUMIF('Base Datos'!$J$5:$J$30000,CONCATENATE(\"S\",B28),'Base Datos'!$I$5:$I$30000)","v":0},0,""]
[null,null,null,null,null,null,null,{"$f":"SUMIF('Base Datos'!$J$5:$J$30000,CONCATENATE(\"E\",B29),'Base Datos'!$I$5:$I$30000)","v":0},{"$f":"SUMIF('Base Datos'!$J$5:$J$30000,CONCATENATE(\"S\",B29),'Base Datos'!$I$5:$I$30000)","v":0},0,""]
[null,null,null,null,null,null,null,{"$f":"SUMIF('Base Datos'!$J$5:$J$30000,CONCATENATE(\"E\",B30),'Base Datos'!$I$5:$I$30000)","v":0},{"$f":"SUMIF('Base Datos'!$J$5:$J$30000,CONCATENATE(\"S\",B30),'Base Datos'!$I$5:$I$30000)","v":0},0,""]
{"$rows_left_out":974}
{"sheet":"Indices","index":3,"n_rows":13,"n_cols":8,"rows_kept":13,"cut":false,"hidden":false,"merged":[[3,2,3,3]]}
[]
[null,"INDICES DE CONTROL"]
[]
[null,null,"Rango Días",null,null,"Ref.",null,"% Partic."]
[null,"Cantidad de referencias agotadas",0,"<=",null,{"$f":"COUNTIF('Control Inv'!$K$6:$K$1000,\"<=\"&C5)","v":0},null,{"$f":"IFERROR(F5/$F$13,0)","v":0}]
[]
[null,"Cantidad de referencias estado critico",1,5,null,{"$f":"COUNTIFS('Control Inv'!$K$6:$K$1000,\">=\"&C7,'Control Inv'!$K$6:$K$1000,\"<=\"&D7)","v":1},null,{"$f":"IFERROR(F7/$F$13,0)","v":0.16666666666666666}]
[]
[null,"Cantidad de referencias inventario optimo",6,30,null,{"$f":"COUNTIFS('Control Inv'!$K$6:$K$1000,\">=\"&C9,'Control Inv'!$K$6:$K$1000,\"<=\"&D9)","v":3},null,{"$f":"IFERROR(F9/$F$13,0)","v":0.5}]
[]
[null,"Cantidad de referencias exceso de inventario",31,">=",null,{"$f":"COUNTIF('Control Inv'!$K$6:$K$1000,\">=\"&C11)","v":2},null,{"$f":"IFERROR(F11/$F$13,0)","v":0.33333333333333331}]
[]
[null,"Total de referencias en inventario",null,null,null,{"$f":"SUM(F5:F11)","v":6},null,{"$f":"SUM(H5:H11)","v":1}]

{"sheet":"Consultas","index":4,"n_rows":47,"n_cols":10,"rows_kept":47,"cut":false,"hidden":true,"merged":[[39,1,39,2],[40,1,40,2],[39,3,39,5],[40,3,40,5],[1,1,1,4],[5,3,5,4],[6,1,6,4],[3,2,3,4],[26,2,26,4],[37,2,37,4]]}
[]
[null,"Consulta de información"]
[]
[null,null,"Consulta de Cartera Clientes"]
[]
[null,"Salida:","S001",{"$f":"IF(C6<>0,(INDEX(#REF!,MATCH($C$6,#REF!,0),1)),\"\")","v":{"$error":"#REF!"}}]
[null,{"$f":"IF(C6<>0,(INDEX(#REF!,MATCH($C$6,#REF!,0),3)),\"\")","v":{"$error":"#REF!"}}]
[]
[null,"Codigo","Producto","Marca","Talla","Cantidad","$$  Und.","$$  Total","Abonos","Saldo"]
[null,0,null,null,0]
[null,0,null,null,0]
[null,0,null,null,0]
[null,0,null,null,0]
[null,0,null,null,0]
[null,0,null,null,0]
[null,0,null,null,0]
[null,0,null,null,0]
[null,0,0,0,0]
[null,0,0,0,0,0,0,0,0,0]
[null,0,0,0,0,0,0,0,0,0]
[null,0,0,0,0,0,0,0,0,0]
[null,0,0,0,0,0,0,0,0,0]
[null,0,0,0,0,0,0,0,0,0]
[null,0,0,0,0,0,0,0,0,0]
[null,null,null,null,null,null,null,{"$f":"SUM(H10:H24)","v":0},{"$f":"SUM(I10:I24)","v":0},{"$f":"SUM(J10:J24)","v":0}]
[]
[null,null,"Consulta de Productos en Inventario"]
[]
[null,"Codigo","Producto","Marca","Talla","$ Costo","$ Venta","% Utili."]
[null,{"$f":"(INDEX('Control Inv'!$B$6:$J$1000,MATCH('Control Inv'!$C$1003,'Control Inv'!$C$6:$C$1000,0),1))","v":{"$error":"#N/A"}},null,{"$f":"(INDEX('Control Inv'!$B$6:$J$1000,MATCH('Control Inv'!$C$1003,'Control Inv'!$C$6:$C$1000,0),3))","v":{"$error":"#N/A"}},{"$f":"(INDEX('Control Inv'!$B$6:$J$1000,MATCH('Control Inv'!$C$1003,'Control Inv'!$C$6:$C$1000,0),4))","v":{"$error":"#N/A"}},{"$f":"(INDEX('Control Inv'!$B$6:$J$1000,MATCH('Control Inv'!$C$1003,'Control Inv'!$C$6:$C$1000,0),5))","v":{"$error":"#N/A"}},{"$f":"(INDEX('Control Inv'!$B$6:$J$1000,MATCH('Control Inv'!$C$1003,'Control Inv'!$C$6:$C$1000,0),6))","v":{"$error":"#N/A"}},{"$f":"(INDEX('Control Inv'!$B$6:$J$1000,MATCH('Control Inv'!$C$1003,'Control Inv'!$C$6:$C$1000,0),7))","v":{"$error":"#N/A"}}]
{"$rows_left_out":17}