{"text_format":"1","workbook":"xlsx","n_sheets":5,"sheets":["Ingreso","BdD Efi","BdD Imp","Metricas","Maestro"],"not_rendered":{"charts":6,"images":1,"macros":1,"external_links":0,"defined_names":3,"comments":0,"pivot_tables":0},"unopened":[],"bounds":{"document_bytes":16777216,"sheet_cells":100000,"rows_first":2000,"rows_last":500,"rows_between":2000,"halvings":0,"cell_chars":16384,"cell_head_chars":4096},"cells_cut":0,"cells_raw":0,"read":"whole","date_system":"1900"}

{"sheet":"Ingreso","index":0,"n_rows":25,"n_cols":35,"rows_kept":25,"cut":false,"hidden":false,"merged":[[3,8,3,13],[1,1,1,6]]}
[]
[null,"CONTROL DE OPERACIÓN EN MANUFACTURA"]
[]
[null,"Fecha","Cod","Causa","N° Ope.","Min. Impro","Hrs. Impro",null,"DATOS GENERALES EFICIENCIA OPERATIVA",null,null,null,null,null,null,null,null,null,null,null,null,null,null,null,null,null,{"$f":"J8","v":"Fecha"},{"$f":"J6","v":"Líder de Proceso"},{"$f":"L6","v":"Líneas Producción"},{"$f":"L8","v":"Cantidad Operarios"},{"$f":"J10","v":"Hora Turno"},{"$f":"L10","v":"Horas Programadas"},{"$f":"J12","v":"Horas Improductivos"},{"$f":"L12","v":"Horas Reales"},{"$f":"K14","v":"Eficiencia Operativa"}]
[null,{"$f":"IF(D5<>\"\",$K$8,0)","v":"00:00:00"},{"$f":"IFERROR(INDEX(Maestro!$B$4:$C$31,MATCH(Ingreso!D5,Maestro!$C$4:$C$31,0),1),\"\")","v":""},null,null,null,{"$f":"(E5*F5)/60","v":0},null,null,null,null,null,null,null,null,null,null,null,null,null,null,null,null,null,null,null,{"$f":"K8","v":"00:00:00"},{"$f":"K6","v":0},{"$f":"M6","v":0},{"$f":"M8","v":0},{"$f":"K10","v":0},{"$f":"M10","v":0},{"$f":"K12","v":0},{"$f":"M12","v":0},{"$f":"L14","v":0}]
[null,{"$f":"IF(D6<>\"\",$K$8,0)","v":"00:00:00"},{"$f":"IFERROR(INDEX(Maestro!$B$4:$C$31,MATCH(Ingreso!D6,Maestro!$C$4:$C$31,0),1),\"\")","v":""},null,null,null,0,null,null,"Líder de Proceso",null,"Líneas Producción"]
[null,"00:00:00",{"$f":"IFERROR(INDEX(Maestro!$B$4:$C$31,MATCH(Ingreso!D7,Maestro!$C$4:$C$31,0),1),\"\")","v":""},null,null,null,0]
[null,"00:00:00",{"$f":"IFERROR(INDEX(Maestro!$B$4:$C$31,MATCH(Ingreso!D8,Maestro!$C$4:$C$31,0),1),\"\")","v":""},null,null,null,0,null,null,"Fecha",null,"Cantidad Operarios"]
[null,"00:00:00",{"$f":"IFERROR(INDEX(Maestro!$B$4:$C$31,MATCH(Ingreso!D9,Maestro!$C$4:$C$31,0),1),\"\")","v":""},null,null,null,0]
[null,"00:00:00",{"$f":"IFERROR(INDEX(Maestro!$B$4:$C$31,MATCH(Ingreso!D10,Maestro!$C$4:$C$31,0),1),\"\")","v":""},null,null,null,0,null,null,"Hora Turno",null,"Horas Programadas",{"$f":"K10*M8","v":0}]
[null,"00:00:00",{"$f":"IFERROR(INDEX(Maestro!$B$4:$C$31,MATCH(Ingreso!D11,Maestro!$C$4:$C$31,0),1),\"\")","v":""},null,null,null,0]
[null,"00:00:00",{"$f":"IFERROR(INDEX(Maestro!$B$4:$C$31,MATCH(Ingreso!D12,Maestro!$C$4:$C$31,0),1),\"\")","v":""},null,null,null,0,null,null,"Horas Improductivos",{"$f":"SUM(G5:G25)","v":0},"Horas Reales",{"$f":"M10-K12","v":0}]
[null,"00:00:00",{"$f":"IFERROR(INDEX(Maestro!$B$4:$C$31,MATCH(Ingreso!D13,Maestro!$C$4:$C$31,0),1),\"\")","v":""},null,null,null,0]
[null,"00:00:00",{"$f":"IFERROR(INDEX(Maestro!$B$4:$C$31,MATCH(Ingreso!D14,Maestro!$C$4:$C$31,0),1),\"\")","v":""},null,null,null,0,null,null,null,"Eficiencia Operativa",{"$f":"IFERROR(M12/M10,0)","v":0}]
[null,"00:00:00",{"$f":"IFERROR(INDEX(Maestro!$B$4:$C$31,MATCH(Ingreso!D15,Maestro!$C$4:$C$31,0),1),\"\")","v":""},null,null,null,0]
[null,"00:00:00",{"$f":"IFERROR(INDEX(Maestro!$B$4:$C$31,MATCH(Ingreso!D16,Maestro!$C$4:$C$31,0),1),\"\")","v":""},null,null,null,0]
[null,"00:00:00",{"$f":"IFERROR(INDEX(Maestro!$B$4:$C$31,MATCH(Ingreso!D17,Maestro!$C$4:$C$31,0),1),\"\")","v":""},null,null,null,0,null,null,{"$f":"L14","v":0}]
[null,"00:00:00",{"$f":"IFERROR(INDEX(Maestro!$B$4:$C$31,MATCH(Ingreso!D18,Maestro!$C$4:$C$31,0),1),\"\")","v":""},null,null,null,0,null,null,{"$f":"1-J17","v":1}]
[null,"00:00:00",{"$f":"IFERROR(INDEX(Maestro!$B$4:$C$31,MATCH(Ingreso!D19,Maestro!$C$4:$C$31,0),1),\"\")","v":""},null,null,null,0]
[null,"00:00:00",{"$f":"IFERROR(INDEX(Maestro!$B$4:$C$31,MATCH(Ingreso!D20,Maestro!$C$4:$C$31,0),1),\"\")","v":""},null,null,null,0]
[null,"00:00:00",{"$f":"IFERROR(INDEX(Maestro!$B$4:$C$31,MATCH(Ingreso!D21,Maestro!$C$4:$C$31,0),1),\"\")","v":""},null,null,null,0]
[null,"00:00:00",{"$f":"IFERROR(INDEX(Maestro!$B$4:$C$31,MATCH(Ingreso!D22,Maestro!$C$4:$C$31,0),1),\"\")","v":""},null,null,null,0]
[null,"00:00:00",{"$f":"IFERROR(INDEX(Maestro!$B$4:$C$31,MATCH(Ingreso!D23,Maestro!$C$4:$C$31,0),1),\"\")","v":""},null,null,null,0]
[null,"00:00:00",{"$f":"IFERROR(INDEX(Maestro!$B$4:$C$31,MATCH(Ingreso!D24,Maestro!$C$4:$C$31,0),1),\"\")","v":""},null,null,null,0]
[null,"00:00:00",{"$f":"IFERROR(INDEX(Maestro!$B$4:$C$31,MATCH(Ingreso!D25,Maestro!$C$4:$C$31,0),1),\"\")","v":""},null,null,null,0]

{"sheet":"BdD Efi","index":1,"n_rows":1000,"n_cols":12,"rows_kept":1000,"cut":false,"hidden":false,"merged":[]}
[]
[null,"Fecha","Lider de Proceso","Lineas Producción","Cantidad Operarios","Hora Turno","Horas Programadas","Horas Improduc.","Horas Reales","Eficiencia Operativa",null,"ID"]
[null,"2021-07-29","KAREN GARCIA","CORTE",8,8,64,3.3333333333333335,60.666666666666664,0.94791666666666663,null,{"$f":"CONCATENATE(MONTH(B3),D3)","v":"7CORTE"}]
[null,"2021-07-29","KAREN GARCIA","CORTE",8,8,64,3.3333333333333335,60.666666666666664,0.94791666666666663,null,{"$f":"CONCATENATE(MONTH(B4),D4)","v":"7CORTE"}]
[null,"2021-07-29","SANTIAGO MARIN","SOLDADURA",8,10,80,7.45,72.55,0.90687499999999999,null,"7SOLDADURA"]
[null,"2021-05-05","CARLOS RUIZ","SOLDADURA",12,8,96,4.833333333333333,91.166666666666671,0.94965277777777779,null,"5SOLDADURA"]
[null,"2021-06-06","KAREN GARCIA","PINTURA",5,8,40,17.75,22.25,0.55625000000000002,null,"6PINTURA"]
[null,"2021-01-12","KAREN GARCIA","PINTURA",5,10,50,6.6666666666666661,43.333333333333336,0.8666666666666667,null,"1PINTURA"]
[null,"2021-02-02","SANTIAGO MARIN","PINTURA",8,10,80,7.45,72.55,0.90687499999999999,null,"2PINTURA"]
[null,"2021-02-02","CARLOS RUIZ","MECANIZADO",12,8,96,4.833333333333333,91.166666666666671,0.94965277777777779,null,"2MECANIZADO"]
[null,"2021-03-03","KAREN GARCIA","MECANIZADO",5,8,40,17.75,22.25,0.55625000000000002,null,"3MECANIZADO"]
[null,"2021-04-04","CARLOS RUIZ","SOLDADURA",12,8,96,4.833333333333333,91.166666666666671,0.94965277777777779,null,"4SOLDADURA"]
[null,"2021-04-04","KAREN GARCIA","EMPAQUE",5,8,40,17.75,22.25,0.55625000000000002,null,"4EMPAQUE"]
[null,"2021-04-04","KAREN GARCIA","EMPAQUE",5,10,50,6.6666666666666661,43.333333333333336,0.8666666666666667,null,"4EMPAQUE"]
[null,null,null,null,null,null,null,null,null,null,null,"1"]
[null,null,null,null,null,null,null,null,null,null,null,"1"]
[null,null,null,null,null,null,null,null,null,null,null,"1"]
[null,null,null,null,null,null,null,null,null,null,null,"1"]
[null,null,null,null,null,null,null,null,null,null,null,"1"]
[null,null,null,null,null,null,null,null,null,null,null,"1"]
[null,null,null,null,null,null,null,null,null,null,null,"1"]
[null,null,null,null,null,null,null,null,null,null,null,"1"]
[null,null,null,null,null,null,null,null,null,null,null,"1"]
[null,null,null,null,null,null,null,null,null,null,null,"1"]
[null,null,null,null,null,null,null,null,null,null,null,"1"]
[null,null,null,null,null,null,null,null,null,null,null,"1"]
[null,null,null,null,null,null,null,null,null,null,null,"1"]
[null,null,null,null,null,null,null,null,null,null,null,"1"]
[null,null,null,null,null,null,null,null,null,null,null,"1"]
[null,null,null,null,null,null,null,null,null,null,null,"1"]
{"$rows_left_out":971}
{"sheet":"BdD Imp","index":2,"n_rows":1000,"n_cols":9,"rows_kept":1000,"cut":false,"hidden":false,"merged":[]}
[]
[null,"Fecha","Cod","Causa","N° Ope.","Min. Impro","Hrs. Impro",null,"ID"]
[null,"2021-07-29","C12","PERMISOS",10,15,2.5,null,{"$f":"CONCATENATE(MONTH(B3),C3)","v":"7C12"}]
[null,"2021-07-29","C16","ASEO",10,20,3.3333333333333335,null,{"$f":"CONCATENATE(MONTH(B4),C4)","v":"7C16"}]
[null,"2021-07-29","C21","PRUEBAS O ENSAYOS",5,15,1.25,null,"7C21"]
[null,"2021-07-29","C26","ACCIDENTE DE TRABAJO ",1,45,0.75,null,"7C26"]
[null,"2021-07-29","C28","ASEO",1,12,0.2,null,"7C28"]
[null,"2021-07-29","C29","REUNIÓN O CAPACITACIÓN ",5,15,1.25,null,"7C29"]
[null,"2021-07-29","C30","SOLICITUD DE MATERIALES NO PARAMETRIZADOS",8,45,6,null,"7C30"]
[null,"2021-05-05","C28","PERMISOS",10,12,2,null,"5C28"]
[null,"2021-05-05","C32","REUNIÓN O CAPACITACIÓN ",8,15,2,null,"5C32"]
[null,"2021-05-05","C13","FALTA DE CLARIDAD EN INFORMACIÓN Y/O FICHAS TÉCNICAS",5,10,0.83333333333333337,null,"5C13"]
[null,"2021-06-06","C29","ACCIDENTE DE TRABAJO ",10,60,10,null,"6C29"]
[null,"2021-06-06","C32","REUNIÓN O CAPACITACIÓN ",12,20,4,null,"6C32"]
[null,"2021-06-06","C32","REUNIÓN O CAPACITACIÓN ",5,45,3.75,null,"6C32"]
[null,"2021-01-12","C12","CAMBIO DE HERRAMIENTA",12,15,3,null,"1C12"]
[null,"2021-01-12","C29","PRUEBAS O ENSAYOS",5,12,1,null,"1C29"]
[null,"2021-01-12","C16","DAÑO DE MÁQUINA ",8,20,2.6666666666666665,null,"1C16"]
[null,"2021-02-02","C28","PERMISOS",10,12,2,null,"2C28"]
[null,"2021-02-02","C32","REUNIÓN O CAPACITACIÓN ",8,15,2,null,"2C32"]
[null,"2021-02-02","C13","FALTA DE CLARIDAD EN INFORMACIÓN Y/O FICHAS TÉCNICAS",5,10,0.83333333333333337,null,"2C13"]
[null,"2021-02-02","C29","ACCIDENTE DE TRABAJO ",10,60,10,null,"2C29"]
[null,"2021-03-03","C30","SOLICITUD DE MATERIALES NO PARAMETRIZADOS",8,45,6,null,"3C30"]
[null,"2021-03-03","C28","PERMISOS",10,12,2,null,"3C28"]
[null,"2021-04-04","C21","PRUEBAS O ENSAYOS",5,15,1.25,null,"4C21"]
[null,"2021-04-04","C26","ACCIDENTE DE TRABAJO ",1,45,0.75,null,"4C26"]
[null,"2021-04-04","C28","ASEO",1,12,0.2,null,"4C28"]
[null,"2021-04-04","C29","REUNIÓN O CAPACITACIÓN ",5,15,1.25,null,"4C29"]
[null,"2021-04-04","C30","SOLICITUD DE MATERIALES NO PARAMETRIZADOS",8,45,6,null,"4C30"]
[null,"2021-04-04","C28","PERMISOS",10,12,2,null,"4C28"]
{"$rows_left_out":971}
{"sheet":"Metricas","index":3,"n_rows":57,"n_cols":15,"rows_kept":57,"cut":false,"hidden":false,"merged":[[1,1,1,6],[28,1,28,6]]}
[]
[null,"MÉTRICA DE EFICIENCIA OPERACIONAL"]
[]
[null,null,"ENE","FEB","MAR","ABR","MAY","JUN","JUL","AGO","SEP","OCT","NOV","DIC","EFI"]
[null,null,1,2,3,4,5,6,7,8,9,10,11,12,"PRO."]
[null,"MECANIZADO",{"$f":"IFERROR(SUMIF('BdD Efi'!$L$3:$L$1000,CONCATENATE(C$5,$B6),'BdD Efi'!$I$3:$I$1000)/SUMIF('BdD Efi'!$L$3:$L$1000,CONCATENATE(C$5,$B6),'BdD Efi'!$G$3:$G$1000),\"\")","v":""},{"$f":"IFERROR(SUMIF('BdD Efi'!$L$3:$L$1000,CONCATENATE(D$5,$B6),'BdD Efi'!$I$3:$I$1000)/SUMIF('BdD Efi'!$L$3:$L$1000,CONCATENATE(D$5,$B6),'BdD Efi'!$G$3:$G$1000),\"\")","v":0.94965277777777779},{"$f":"IFERROR(SUMIF('BdD Efi'!$L$3:$L$1000,CONCATENATE(E$5,$B6),'BdD Efi'!$I$3:$I$1000)/SUMIF('BdD Efi'!$L$3:$L$1000,CONCATENATE(E$5,$B6),'BdD Efi'!$G$3:$G$1000),\"\")","v":0.55625000000000002},{"$f":"IFERROR(SUMIF('BdD Efi'!$L$3:$L$1000,CONCATENATE(F$5,$B6),'BdD Efi'!$I$3:$I$1000)/SUMIF('BdD Efi'!$L$3:$L$1000,CONCATENATE(F$5,$B6),'BdD Efi'!$G$3:$G$1000),\"\")","v":""},{"$f":"IFERROR(SUMIF('BdD Efi'!$L$3:$L$1000,CONCATENATE(G$5,$B6),'BdD Efi'!$I$3:$I$1000)/SUMIF('BdD Efi'!$L$3:$L$1000,CONCATENATE(G$5,$B6),'BdD Efi'!$G$3:$G$1000),\"\")","v":""},{"$f":"IFERROR(SUMIF('BdD Efi'!$L$3:$L$1000,CONCATENATE(H$5,$B6),'BdD Efi'!$I$3:$I$1000)/SUMIF('BdD Efi'!$L$3:$L$1000,CONCATENATE(H$5,$B6),'BdD Efi'!$G$3:$G$1000),\"\")","v":""},{"$f":"IFERROR(SUMIF('BdD Efi'!$L$3:$L$1000,CONCATENATE(I$5,$B6),'BdD Efi'!$I$3:$I$1000)/SUMIF('BdD Efi'!$L$3:$L$1000,CONCATENATE(I$5,$B6),'BdD Efi'!$G$3:$G$1000),\"\")","v":""},{"$f":"IFERROR(SUMIF('BdD Efi'!$L$3:$L$1000,CONCATENATE(J$5,$B6),'BdD Efi'!$I$3:$I$1000)/SUMIF('BdD Efi'!$L$3:$L$1000,CONCATENATE(J$5,$B6),'BdD Efi'!$G$3:$G$1000),\"\")","v":""},{"$f":"IFERROR(SUMIF('BdD Efi'!$L$3:$L$1000,CONCATENATE(K$5,$B6),'BdD Efi'!$I$3:$I$1000)/SUMIF('BdD Efi'!$L$3:$L$1000,CONCATENATE(K$5,$B6),'BdD Efi'!$G$3:$G$1000),\"\")","v":""},{"$f":"IFERROR(SUMIF('BdD Efi'!$L$3:$L$1000,CONCATENATE(L$5,$B6),'BdD Efi'!$I$3:$I$1000)/SUMIF('BdD Efi'!$L$3:$L$1000,CONCATENATE(L$5,$B6),'BdD Efi'!$G$3:$G$1000),\"\")","v":""},{"$f":"IFERROR(SUMIF('BdD Efi'!$L$3:$L$1000,CONCATENATE(M$5,$B6),'BdD Efi'!$I$3:$I$1000)/SUMIF('BdD Efi'!$L$3:$L$1000,CONCATENATE(M$5,$B6),'BdD Efi'!$G$3:$G$1000),\"\")","v":""},{"$f":"IFERROR(SUMIF('BdD Efi'!$L$3:$L$1000,CONCATENATE(N$5,$B6),'BdD Efi'!$I$3:$I$1000)/SUMIF('BdD Efi'!$L$3:$L$1000,CONCATENATE(N$5,$B6),'BdD Efi'!$G$3:$G$1000),\"\")","v":""},{"$f":"IFERROR(AVERAGE(C6:N6),0)","v":0.75295138888888891}]
[null,"CORTE",{"$f":"IFERROR(SUMIF('BdD Efi'!$L$3:$L$1000,CONCATENATE(C$5,$B7),'BdD Efi'!$I$3:$I$1000)/SUMIF('BdD Efi'!$L$3:$L$1000,CONCATENATE(C$5,$B7),'BdD Efi'!$G$3:$G$1000),\"\")","v":""},{"$f":"IFERROR(SUMIF('BdD Efi'!$L$3:$L$1000,CONCATENATE(D$5,$B7),'BdD Efi'!$I$3:$I$1000)/SUMIF('BdD Efi'!$L$3:$L$1000,CONCATENATE(D$5,$B7),'BdD Efi'!$G$3:$G$1000),\"\")","v":""},{"$f":"IFERROR(SUMIF('BdD Efi'!$L$3:$L$1000,CONCATENATE(E$5,$B7),'BdD Efi'!$I$3:$I$1000)/SUMIF('BdD Efi'!$L$3:$L$1000,CONCATENATE(E$5,$B7),'BdD Efi'!$G$3:$G$1000),\"\")","v":""},{"$f":"IFERROR(SUMIF('BdD Efi'!$L$3:$L$1000,CONCATENATE(F$5,$B7),'BdD Efi'!$I$3:$I$1000)/SUMIF('BdD Efi'!$L$3:$L$1000,CONCATENATE(F$5,$B7),'BdD Efi'!$G$3:$G$1000),\"\")","v":""},{"$f":"IFERROR(SUMIF('BdD Efi'!$L$3:$L$1000,CONCATENATE(G$5,$B7),'BdD Efi'!$I$3:$I$1000)/SUMIF('BdD Efi'!$L$3:$L$1000,CONCATENATE(G$5,$B7),'BdD Efi'!$G$3:$G$1000),\"\")","v":""},{"$f":"IFERROR(SUMIF('BdD Efi'!$L$3:$L$1000,CONCATENATE(H$5,$B7),'BdD Efi'!$I$3:$I$1000)/SUMIF('BdD Efi'!$L$3:$L$1000,CONCATENATE(H$5,$B7),'BdD Efi'!$G$3:$G$1000),\"\")","v":""},{"$f":"IFERROR(SUMIF('BdD Efi'!$L$3:$L$1000,CONCATENATE(I$5,$B7),'BdD Efi'!$I$3:$I$1000)/SUMIF('BdD Efi'!$L$3:$L$1000,CONCATENATE(I$5,$B7),'BdD Efi'!$G$3:$G$1000),\"\")","v":0.94791666666666663},{"$f":"IFERROR(SUMIF('BdD Efi'!$L$3:$L$1000,CONCATENATE(J$5,$B7),'BdD Efi'!$I$3:$I$1000)/SUMIF('BdD Efi'!$L$3:$L$1000,CONCATENATE(J$5,$B7),'BdD Efi'!$G$3:$G$1000),\"\")","v":""},{"$f":"IFERROR(SUMIF('BdD Efi'!$L$3:$L$1000,CONCATENATE(K$5,$B7),'BdD Efi'!$I$3:$I$1000)/SUMIF('BdD Efi'!$L$3:$L$1000,CONCATENATE(K$5,$B7),'BdD Efi'!$G$3:$G$1000),\"\")","v":""},{"$f":"IFERROR(SUMIF('BdD Efi'!$L$3:$L$1000,CONCATENATE(L$5,$B7),'BdD Efi'!$I$3:$I$1000)/SUMIF('BdD Efi'!$L$3:$L$1000,CONCATENATE(L$5,$B7),'BdD Efi'!$G$3:$G$1000),\"\")","v":""},{"$f":"IFERROR(SUMIF('BdD Efi'!$L$3:$L$1000,CONCATENATE(M$5,$B7),'BdD Efi'!$I$3:$I$1000)/SUMIF('BdD Efi'!$L$3:$L$1000,CONCATENATE(M$5,$B7),'BdD Efi'!$G$3:$G$1000),\"\")","v":""},{"$f":"IFERROR(SUMIF('BdD Efi'!$L$3:$L$1000,CONCATENATE(N$5,$B7),'BdD Efi'!$I$3:$I$1000)/SUMIF('BdD Efi'!$L$3:$L$1000,CONCATENATE(N$5,$B7),'BdD Efi'!$G$3:$G$1000),\"\")","v":""},{"$f":"IFERROR(AVERAGE(C7:N7),0)","v":0.94791666666666663}]
[null,"SOLDADURA",{"$f":"IFERROR(SUMIF('BdD Efi'!$L$3:$L$1000,CONCATENATE(C$5,$B8),'BdD Efi'!$I$3:$I$1000)/SUMIF('BdD Efi'!$L$3:$L$1000,CONCATENATE(C$5,$B8),'BdD Efi'!$G$3:$G$1000),\"\")","v":""},{"$f":"IFERROR(SUMIF('BdD Efi'!$L$3:$L$1000,CONCATENATE(D$5,$B8),'BdD Efi'!$I$3:$I$1000)/SUMIF('BdD Efi'!$L$3:$L$1000,CONCATENATE(D$5,$B8),'BdD Efi'!$G$3:$G$1000),\"\")","v":""},{"$f":"IFERROR(SUMIF('BdD Efi'!$L$3:$L$1000,CONCATENATE(E$5,$B8),'BdD Efi'!$I$3:$I$1000)/SUMIF('BdD Efi'!$L$3:$L$1000,CONCATENATE(E$5,$B8),'BdD Efi'!$G$3:$G$1000),\"\")","v":""},{"$f":"IFERROR(SUMIF('BdD Efi'!$L$3:$L$1000,CONCATENATE(F$5,$B8),'BdD Efi'!$I$3:$I$1000)/SUMIF('BdD Efi'!$L$3:$L$1000,CONCATENATE(F$5,$B8),'BdD Efi'!$G$3:$G$1000),\"\")","v":0.94965277777777779},{"$f":"IFERROR(SUMIF('BdD Efi'!$L$3:$L$1000,CONCATENATE(G$5,$B8),'BdD Efi'!$I$3:$I$1000)/SUMIF('BdD Efi'!$L$3:$L$1000,CONCATENATE(G$5,$B8),'BdD Efi'!$G$3:$G$1000),\"\")","v":0.94965277777777779},{"$f":"IFERROR(SUMIF('BdD Efi'!$L$3:$L$1000,CONCATENATE(H$5,$B8),'BdD Efi'!$I$3:$I$1000)/SUMIF('BdD Efi'!$L$3:$L$1000,CONCATENATE(H$5,$B8),'BdD Efi'!$G$3:$G$1000),\"\")","v":""},{"$f":"IFERROR(SUMIF('BdD Efi'!$L$3:$L$1000,CONCATENATE(I$5,$B8),'BdD Efi'!$I$3:$I$1000)/SUMIF('BdD Efi'!$L$3:$L$1000,CONCATENATE(I$5,$B8),'BdD Efi'!$G$3:$G$1000),\"\")","v":0.90687499999999999},{"$f":"IFERROR(SUMIF('BdD Efi'!$L$3:$L$1000,CONCATENATE(J$5,$B8),'BdD Efi'!$I$3:$I$1000)/SUMIF('BdD Efi'!$L$3:$L$1000,CONCATENATE(J$5,$B8),'BdD Efi'!$G$3:$G$1000),\"\")","v":""},{"$f":"IFERROR(SUMIF('BdD Efi'!$L$3:$L$1000,CONCATENATE(K$5,$B8),'BdD Efi'!$I$3:$I$1000)/SUMIF('BdD Efi'!$L$3:$L$1000,CONCATENATE(K$5,$B8),'BdD Efi'!$G$3:$G$1000),\"\")","v":""},{"$f":"IFERROR(SUMIF('BdD Efi'!$L$3:$L$1000,CONCATENATE(L$5,$B8),'BdD Efi'!$I$3:$I$1000)/SUMIF('BdD Efi'!$L$3:$L$1000,CONCATENATE(L$5,$B8),'BdD Efi'!$G$3:$G$1000),\"\")","v":""},{"$f":"IFERROR(SUMIF('BdD Efi'!$L$3:$L$1000,CONCATENATE(M$5,$B8),'BdD Efi'!$I$3:$I$1000)/SUMIF('BdD Efi'!$L$3:$L$1000,CONCATENATE(M$5,$B8),'BdD Efi'!$G$3:$G$1000),\"\")","v":""},{"$f":"IFERROR(SUMIF('BdD Efi'!$L$3:$L$1000,CONCATENATE(N$5,$B8),'BdD Efi'!$I$3:$I$1000)/SUMIF('BdD Efi'!$L$3:$L$1000,CONCATENATE(N$5,$B8),'BdD Efi'!$G$3:$G$1000),\"\")","v":""},0.9353935185185186]
[null,"ENSAMBLE",{"$f":"IFERROR(SUMIF('BdD Efi'!$L$3:$L$1000,CONCATENATE(C$5,$B9),'BdD Efi'!$I$3:$I$1000)/SUMIF('BdD Efi'!$L$3:$L$1000,CONCATENATE(C$5,$B9),'BdD Efi'!$G$3:$G$1000),\"\")","v":""},{"$f":"IFERROR(SUMIF('BdD Efi'!$L$3:$L$1000,CONCATENATE(D$5,$B9),'BdD Efi'!$I$3:$I$1000)/SUMIF('BdD Efi'!$L$3:$L$1000,CONCATENATE(D$5,$B9),'BdD Efi'!$G$3:$G$1000),\"\")","v":""},{"$f":"IFERROR(SUMIF('BdD Efi'!$L$3:$L$1000,CONCATENATE(E$5,$B9),'BdD Efi'!$I$3:$I$1000)/SUMIF('BdD Efi'!$L$3:$L$1000,CONCATENATE(E$5,$B9),'BdD Efi'!$G$3:$G$1000),\"\")","v":""},{"$f":"IFERROR(SUMIF('BdD Efi'!$L$3:$L$1000,CONCATENATE(F$5,$B9),'BdD Efi'!$I$3:$I$1000)/SUMIF('BdD Efi'!$L$3:$L$1000,CONCATENATE(F$5,$B9),'BdD Efi'!$G$3:$G$1000),\"\")","v":""},{"$f":"IFERROR(SUMIF('BdD Efi'!$L$3:$L$1000,CONCATENATE(G$5,$B9),'BdD Efi'!$I$3:$I$1000)/SUMIF('BdD Efi'!$L$3:$L$1000,CONCATENATE(G$5,$B9),'BdD Efi'!$G$3:$G$1000),\"\")","v":""},{"$f":"IFERROR(SUMIF('BdD Efi'!$L$3:$L$1000,CONCATENATE(H$5,$B9),'BdD Efi'!$I$3:$I$1000)/SUMIF('BdD Efi'!$L$3:$L$1000,CONCATENATE(H$5,$B9),'BdD Efi'!$G$3:$G$1000),\"\")","v":""},{"$f":"IFERROR(SUMIF('BdD Efi'!$L$3:$L$1000,CONCATENATE(I$5,$B9),'BdD Efi'!$I$3:$I$1000)/SUMIF('BdD Efi'!$L$3:$L$1000,CONCATENATE(I$5,$B9),'BdD Efi'!$G$3:$G$1000),\"\")","v":""},{"$f":"IFERROR(SUMIF('BdD Efi'!$L$3:$L$1000,CONCATENATE(J$5,$B9),'BdD Efi'!$I$3:$I$1000)/SUMIF('BdD Efi'!$L$3:$L$1000,CONCATENATE(J$5,$B9),'BdD Efi'!$G$3:$G$1000),\"\")","v":""},{"$f":"IFERROR(SUMIF('BdD Efi'!$L$3:$L$1000,CONCATENATE(K$5,$B9),'BdD Efi'!$I$3:$I$1000)/SUMIF('BdD Efi'!$L$3:$L$1000,CONCATENATE(K$5,$B9),'BdD Efi'!$G$3:$G$1000),\"\")","v":""},{"$f":"IFERROR(SUMIF('BdD Efi'!$L$3:$L$1000,CONCATENATE(L$5,$B9),'BdD Efi'!$I$3:$I$1000)/SUMIF('BdD Efi'!$L$3:$L$1000,CONCATENATE(L$5,$B9),'BdD Efi'!$G$3:$G$1000),\"\")","v":""},{"$f":"IFERROR(SUMIF('BdD Efi'!$L$3:$L$1000,CONCATENATE(M$5,$B9),'BdD Efi'!$I$3:$I$1000)/SUMIF('BdD Efi'!$L$3:$L$1000,CONCATENATE(M$5,$B9),'BdD Efi'!$G$3:$G$1000),\"\")","v":""},{"$f":"IFERROR(SUMIF('BdD Efi'!$L$3:$L$1000,CONCATENATE(N$5,$B9),'BdD Efi'!$I$3:$I$1000)/SUMIF('BdD Efi'!$L$3:$L$1000,CONCATENATE(N$5,$B9),'BdD Efi'!$G$3:$G$1000),\"\")","v":""},0]
[null,"PINTURA",{"$f":"IFERROR(SUMIF('BdD Efi'!$L$3:$L$1000,CONCATENATE(C$5,$B10),'BdD Efi'!$I$3:$I$1000)/SUMIF('BdD Efi'!$L$3:$L$1000,CONCATENATE(C$5,$B10),'BdD Efi'!$G$3:$G$1000),\"\")","v":0.8666666666666667},{"$f":"IFERROR(SUMIF('BdD Efi'!$L$3:$L$1000,CONCATENATE(D$5,$B10),'BdD Efi'!$I$3:$I$1000)/SUMIF('BdD Efi'!$L$3:$L$1000,CONCATENATE(D$5,$B10),'BdD Efi'!$G$3:$G$1000),\"\")","v":0.90687499999999999},{"$f":"IFERROR(SUMIF('BdD Efi'!$L$3:$L$1000,CONCATENATE(E$5,$B10),'BdD Efi'!$I$3:$I$1000)/SUMIF('BdD Efi'!$L$3:$L$1000,CONCATENATE(E$5,$B10),'BdD Efi'!$G$3:$G$1000),\"\")","v":""},{"$f":"IFERROR(SUMIF('BdD Efi'!$L$3:$L$1000,CONCATENATE(F$5,$B10),'BdD Efi'!$I$3:$I$1000)/SUMIF('BdD Efi'!$L$3:$L$1000,CONCATENATE(F$5,$B10),'BdD Efi'!$G$3:$G$1000),\"\")","v":""},{"$f":"IFERROR(SUMIF('BdD Efi'!$L$3:$L$1000,CONCATENATE(G$5,$B10),'BdD Efi'!$I$3:$I$1000)/SUMIF('BdD Efi'!$L$3:$L$1000,CONCATENATE(G$5,$B10),'BdD Efi'!$G$3:$G$1000),\"\")","v":""},{"$f":"IFERROR(SUMIF('BdD Efi'!$L$3:$L$1000,CONCATENATE(H$5,$B10),'BdD Efi'!$I$3:$I$1000)/SUMIF('BdD Efi'!$L$3:$L$1000,CONCATENATE(H$5,$B10),'BdD Efi'!$G$3:$G$1000),\"\")","v":0.55625000000000002},{"$f":"IFERROR(SUMIF('BdD Efi'!$L$3:$L$1000,CONCATENATE(I$5,$B10),'BdD Efi'!$I$3:$I$1000)/SUMIF('BdD Efi'!$L$3:$L$1000,CONCATENATE(I$5,$B10),'BdD Efi'!$G$3:$G$1000),\"\")","v":""},{"$f":"IFERROR(SUMIF('BdD Efi'!$L$3:$L$1000,CONCATENATE(J$5,$B10),'BdD Efi'!$I$3:$I$1000)/SUMIF('BdD Efi'!$L$3:$L$1000,CONCATENATE(J$5,$B10),'BdD Efi'!$G$3:$G$1000),\"\")","v":""},{"$f":"IFERROR(SUMIF('BdD Efi'!$L$3:$L$1000,CONCATENATE(K$5,$B10),'BdD Efi'!$I$3:$I$1000)/SUMIF('BdD Efi'!$L$3:$L$1000,CONCATENATE(K$5,$B10),'BdD Efi'!$G$3:$G$1000),\"\")","v":""},{"$f":"IFERROR(SUMIF('BdD Efi'!$L$3:$L$1000,CONCATENATE(L$5,$B10),'BdD Efi'!$I$3:$I$1000)/SUMIF('BdD Efi'!$L$3:$L$1000,CONCATENATE(L$5,$B10),'BdD Efi'!$G$3:$G$1000),\"\")","v":""},{"$f":"IFERROR(SUMIF('BdD Efi'!$L$3:$L$1000,CONCATENATE(M$5,$B10),'BdD Efi'!$I$3:$I$1000)/SUMIF('BdD Efi'!$L$3:$L$1000,CONCATENATE(M$5,$B10),'BdD Efi'!$G$3:$G$1000),\"\")","v":""},{"$f":"IFERROR(SUMIF('BdD Efi'!$L$3:$L$1000,CONCATENATE(N$5,$B10),'BdD Efi'!$I$3:$I$1000)/SUMIF('BdD Efi'!$L$3:$L$1000,CONCATENATE(N$5,$B10),'BdD Efi'!$G$3:$G$1000),\"\")","v":""},0.77659722222222216]
[null,"EMPAQUE",{"$f":"IFERROR(SUMIF('BdD Efi'!$L$3:$L$1000,CONCATENATE(C$5,$B11),'BdD Efi'!$I$3:$I$1000)/SUMIF('BdD Efi'!$L$3:$L$1000,CONCATENATE(C$5,$B11),'BdD Efi'!$G$3:$G$1000),\"\")","v":""},{"$f":"IFERROR(SUMIF('BdD Efi'!$L$3:$L$1000,CONCATENATE(D$5,$B11),'BdD Efi'!$I$3:$I$1000)/SUMIF('BdD Efi'!$L$3:$L$1000,CONCATENATE(D$5,$B11),'BdD Efi'!$G$3:$G$1000),\"\")","v":""},{"$f":"IFERROR(SUMIF('BdD Efi'!$L$3:$L$1000,CONCATENATE(E$5,$B11),'BdD Efi'!$I$3:$I$1000)/SUMIF('BdD Efi'!$L$3:$L$1000,CONCATENATE(E$5,$B11),'BdD Efi'!$G$3:$G$1000),\"\")","v":""},{"$f":"IFERROR(SUMIF('BdD Efi'!$L$3:$L$1000,CONCATENATE(F$5,$B11),'BdD Efi'!$I$3:$I$1000)/SUMIF('BdD Efi'!$L$3:$L$1000,CONCATENATE(F$5,$B11),'BdD Efi'!$G$3:$G$1000),\"\")","v":0.72870370370370385},{"$f":"IFERROR(SUMIF('BdD Efi'!$L$3:$L$1000,CONCATENATE(G$5,$B11),'BdD Efi'!$I$3:$I$1000)/SUMIF('BdD Efi'!$L$3:$L$1000,CONCATENATE(G$5,$B11),'BdD Efi'!$G$3:$G$1000),\"\")","v":""},{"$f":"IFERROR(SUMIF('BdD Efi'!$L$3:$L$1000,CONCATENATE(H$5,$B11),'BdD Efi'!$I$3:$I$1000)/SUMIF('BdD Efi'!$L$3:$L$1000,CONCATENATE(H$5,$B11),'BdD Efi'!$G$3:$G$1000),\"\")","v":""},{"$f":"IFERROR(SUMIF('BdD Efi'!$L$3:$L$1000,CONCATENATE(I$5,$B11),'BdD Efi'!$I$3:$I$1000)/SUMIF('BdD Efi'!$L$3:$L$1000,CONCATENATE(I$5,$B11),'BdD Efi'!$G$3:$G$1000),\"\")","v":""},{"$f":"IFERROR(SUMIF('BdD Efi'!$L$3:$L$1000,CONCATENATE(J$5,$B11),'BdD Efi'!$I$3:$I$1000)/SUMIF('BdD Efi'!$L$3:$L$1000,CONCATENATE(J$5,$B11),'BdD Efi'!$G$3:$G$1000),\"\")","v":""},{"$f":"IFERROR(SUMIF('BdD Efi'!$L$3:$L$1000,CONCATENATE(K$5,$B11),'BdD Efi'!$I$3:$I$1000)/SUMIF('BdD Efi'!$L$3:$L$1000,CONCATENATE(K$5,$B11),'BdD Efi'!$G$3:$G$1000),\"\")","v":""},{"$f":"IFERROR(SUMIF('BdD Efi'!$L$3:$L$1000,CONCATENATE(L$5,$B11),'BdD Efi'!$I$3:$I$1000)/SUMIF('BdD Efi'!$L$3:$L$1000,CONCATENATE(L$5,$B11),'BdD Efi'!$G$3:$G$1000),\"\")","v":""},{"$f":"IFERROR(SUMIF('BdD Efi'!$L$3:$L$1000,CONCATENATE(M$5,$B11),'BdD Efi'!$I$3:$I$1000)/SUMIF('BdD Efi'!$L$3:$L$1000,CONCATENATE(M$5,$B11),'BdD Efi'!$G$3:$G$1000),\"\")","v":""},{"$f":"IFERROR(SUMIF('BdD Efi'!$L$3:$L$1000,CONCATENATE(N$5,$B11),'BdD Efi'!$I$3:$I$1000)/SUMIF('BdD Efi'!$L$3:$L$1000,CONCATENATE(N$5,$B11),'BdD Efi'!$G$3:$G$1000),\"\")","v":""},0.72870370370370385]
[null,"EFI-MES",{"$f":"IFERROR(AVERAGE(C6:C11),0)","v":0.8666666666666667},{"$f":"IFERROR(AVERAGE(D6:D11),0)","v":0.92826388888888889},0.55625000000000002,0.83917824074074088,0.94965277777777779,0.55625000000000002,0.92739583333333331,0,0,0,0,0]
[]
[]
[]
[]
[]
[]
[]
[]
[]
[]
[]
[]
[]
[]
[]
[]
[null,"MÉTRICA DE TIEMPOS EN HORAS IMPRODUCTIVOS"]
[]
{"$rows_left_out":28}
{"sheet":"Maestro","index":4,"n_rows":26,"n_cols":7,"rows_kept":26,"cut":false,"hidden":false,"merged":[]}
[]
[]
[null,"Código","Causa Improductividad",null,"Líneas Producción",null,"Líder de proceso"]
[null,"C10","ACCIDENTE DE TRABAJO ",null,"MECANIZADO",null,"CARLOS RUIZ"]
[null,"C11","ASEO",null,"CORTE",null,"SANTIAGO MARIN"]
[null,"C12","CAMBIO DE HERRAMIENTA",null,"SOLDADURA",null,"KAREN GARCIA"]
[null,"C13","CAMBIO DE PROGRAMACIÓN ",null,"ENSAMBLE",null,"EDISON CANO"]
[null,"C14","CLASIFICACIÓN DE MATERIAL ",null,"PINTURA",null,"ANDREA MONTOYA"]
[null,"C15","DAÑO DE HERRAMIENTA",null,"EMPAQUE"]
[null,"C16","DAÑO DE MÁQUINA "]
[null,"C17","DAR O RECIBIR INDUCCIÓN "]
[null,"C18","DEFECTOS EN LOS MATERIALES "]
[null,"C19","DIFERENCIAS EN LAS CANTIDAD DE LOS MATERIALES "]
[null,"C20","FALTA DE CLARIDAD EN INFORMACIÓN Y/O FICHAS TÉCNICAS"]
[null,"C21","FALTA DE MATERIAL"]
[null,"C22","FALTA DE PATINADOR"]
[null,"C23","GESTIÓN DE MANTENIMIENTO "]
[null,"C24","HACER INVENTARIO DE MATERIAL "]
[null,"C25","HERRAMIENTA MAL ESTADO"]
[null,"C26","MONTAJES CON INTERVENCIÓN DE MANTENIMIENTO"]
[null,"C27","OTROS"]
[null,"C28","PERMISOS"]
[null,"C29","PRUEBAS O ENSAYOS"]
[null,"C30","REPROCESOS"]
[null,"C31","REUNIÓN O CAPACITACIÓN "]
[null,"C32","SOLICITUD DE MATERIALES NO PARAMETRIZADOS"]